I have problems to install psrchive

0 votes
I was fallow Stable Release Build and Installation in process make
then I got this error

../../More/MEAL/stl_vector.h:201:39: warning: control reaches end of non-void function [-Wreturn-type]
In file included from ../../local_include/Pulsar/Config.h:20:0,
                 from ../../local_include/Pulsar/Archive.h:20,
                 from counter_drift.C:8:
../../local_include/TextInterface.h: In member function ‘virtual bool TextInterface::NestedValue::matches(const string&) const’:
../../local_include/TextInterface.h:102:47: warning: control reaches end of non-void function [-Wreturn-type]
../../local_include/TextInterface.h: In member function ‘virtual bool TextInterface::Value::matches(const string&) const’:
../../local_include/TextInterface.h:66:5: warning: control reaches end of non-void function [-Wreturn-type]
make[2]: *** [counter_drift.lo] Error 1
make[2]: Leaving directory `/home/boltfox/psrsoft/usr/src/psrchive/More/General'
make[1]: *** [install-recursive] Error 1
make[1]: Leaving directory `/home/boltfox/psrsoft/usr/src/psrchive/More'
make: *** [install-recursive] Error 1

 

Can someone tell me how to solve this T T

Boltfox
asked Apr 14, 2014 by anonymous
edited Mar 19, 2014 by

1 Answer

0 votes
Hi Boltfox,

We'll be releasing a new "stable" version of psrchive this week; this release should fix up this compilation error.

Cheers,
Willem
answered Apr 14, 2014 by straten (630 points)
...